[ODE] Undefined symbol for OSX build

Rick Ashton expiation at devils.com
Fri Sep 14 23:19:25 MST 2007


Been trying to build the various versioned builds of ODE on Mac OS X  
10.4 using the instructions given but always end up with:

/usr/bin/ld: Undefined symbols:
dsPlatformSimLoop(int, int, dsFunctions*, int)
collect2: ld returned 1 exit status
make[2]: *** [dstest] Error 1
make[1]: *** [all-recursive] Error 1
make: *** [all-recursive] Error 1

Can't seem to find anything about this on google.

Can someone help?


More information about the ODE mailing list