[ODE] OSX compile problem

Vo Spader spader at aboveultimate.com
Thu Dec 28 08:28:34 MST 2006

I'm trying to compile ODE on Mac OSX however whenever I 'make' i end up with
make[2]: *** [libdrawstuff_a-osx.o] Error 1
make[1]: *** [all-recursive] Error 1
make: *** [all-recursive] Error 1

Does anybody have any idea on how I might be able to compile this properly?


PS: I'm using a SVN checkout
-------------- next part --------------
An HTML attachment was scrubbed...
URL: http://q12.org/pipermail/ode/attachments/20061228/16f4325c/attachment.htm

More information about the ODE mailing list